Reaction Details
TargetCollagenase 3
LigandBDBM50160847
Substrate/Competitorn/a
Meas. Tech.ChEMBL_458933 (CHEMBL924952)
Ki 4.7±n/a nM
Citation Verma, RPHansch, C Matrix metalloproteinases (MMPs): chemical-biological functions and (Q)SARs. Bioorg Med Chem15:2223-68 (2007) 
 
Collagenase 3
Name:Collagenase 3
Type:Enzyme
Mol. Mass.:53808.06
Organism:Homo sapiens (Human)
Description:P45452
Residue:471
BDBM50160847
NameBDBM50160847
Synonyms:1-(4-phenoxy-phenyl)-1,7,9-triaza-spiro[4.5]decane-2,6,8,10-tetraone | CHEMBL178509
TypeSmall organic molecule
Emp. Form.C19H15N3O5
Mol. Mass.365.3395
SMILESO=C1CCC2(N1c1ccc(Oc3ccccc3)cc1)C(=O)NC(=O)NC2=O