Reaction Details
Target72 kDa type IV collagenase
LigandBDBM11362
Substrate/Competitorn/a
Meas. Tech.ChEMBL_458931 (CHEMBL924950)
Ki 3.7±n/a nM
Citation Verma, RPHansch, C Matrix metalloproteinases (MMPs): chemical-biological functions and (Q)SARs. Bioorg Med Chem15:2223-68 (2007) 
 
72 kDa type IV collagenase
Name:72 kDa type IV collagenase
Type:Enzyme
Mol. Mass.:73870.36
Organism:Homo sapiens (Human)
Description: P08253
Residue:660
BDBM11362
NameBDBM11362
Synonyms:2-{[(2-chlorophenyl)methyl](1,1,2,2,3,3,4,4,4-nonafluorobutane)sulfonamido}-N-hydroxypropanamide hydroxamate deriv. B4
TypeSmall organic molecule
Emp. Form.C14H12ClF9N2O4S
Mol. Mass.510.76
SMILESCC(N(Cc1ccccc1Cl)S(=O)(=O)C(F)(F)C(F)(F)C(F)(F)C(F)(F)F)C(=O)NO