Reaction Details
TargetCollagenase 3
LigandBDBM50160855
Substrate/Competitorn/a
Meas. Tech.ChEMBL_458933 (CHEMBL924952)
Ki 0.955000±n/a nM
Citation Verma, RPHansch, C Matrix metalloproteinases (MMPs): chemical-biological functions and (Q)SARs. Bioorg Med Chem15:2223-68 (2007) 
 
Collagenase 3
Name:Collagenase 3
Type:Enzyme
Mol. Mass.:53808.06
Organism:Homo sapiens (Human)
Description:P45452
Residue:471
BDBM50160855
NameBDBM50160855
Synonyms:1-[4-(4-chloro-phenoxy)-phenyl]-1,7,9-triaza-spiro[4.5]decane-2,6,8,10-tetraone | CHEMBL180616
TypeSmall organic molecule
Emp. Form.C19H14ClN3O5
Mol. Mass.399.785
SMILESClc1ccc(Oc2ccc(cc2)N2C(=O)CCC22C(=O)NC(=O)NC2=O)cc1