Reaction Details
Target72 kDa type IV collagenase
LigandBDBM50423400
Substrate/Competitorn/a
Meas. Tech.ChEMBL_458931 (CHEMBL924950)
Ki 3.7±n/a nM
Citation Verma, RPHansch, C Matrix metalloproteinases (MMPs): chemical-biological functions and (Q)SARs. Bioorg Med Chem15:2223-68 (2007) 
 
72 kDa type IV collagenase
Name:72 kDa type IV collagenase
Type:Enzyme
Mol. Mass.:73870.36
Organism:Homo sapiens (Human)
Description: P08253
Residue:660
BDBM50423400
NameBDBM50423400
Synonyms:CHEMBL122719
TypeSmall organic molecule
Emp. Form.C13H10F9N3O6S
Mol. Mass.507.286
SMILESONC(=O)CN(Cc1ccccc1[N+]([O-])=O)S(=O)(=O)C(F)(F)C(F)(F)C(F)(F)C(F)(F)F