Reaction Details
TargetMatrix metalloproteinase-9
LigandBDBM50160855
Substrate/Competitorn/a
Meas. Tech.ChEMBL_458932 (CHEMBL924951)
Ki 0.724000±n/a nM
Citation Verma, RPHansch, C Matrix metalloproteinases (MMPs): chemical-biological functions and (Q)SARs. Bioorg Med Chem15:2223-68 (2007) 
 
Matrix metalloproteinase-9
Name:Matrix metalloproteinase-9
Type:Enzyme
Mol. Mass.:78452.28
Organism:Homo sapiens (Human)
Description:P14780
Residue:707
BDBM50160855
NameBDBM50160855
Synonyms:1-[4-(4-chloro-phenoxy)-phenyl]-1,7,9-triaza-spiro[4.5]decane-2,6,8,10-tetraone | CHEMBL180616
TypeSmall organic molecule
Emp. Form.C19H14ClN3O5
Mol. Mass.399.785
SMILESClc1ccc(Oc2ccc(cc2)N2C(=O)CCC22C(=O)NC(=O)NC2=O)cc1