Reaction Details
TargetMatrix metalloproteinase-9
LigandBDBM50088128
Substrate/Competitorn/a
Meas. Tech.ChEMBL_458932 (CHEMBL924951)
Ki 2.0±n/a nM
Citation Verma, RPHansch, C Matrix metalloproteinases (MMPs): chemical-biological functions and (Q)SARs. Bioorg Med Chem15:2223-68 (2007) 
 
Matrix metalloproteinase-9
Name:Matrix metalloproteinase-9
Type:Enzyme
Mol. Mass.:78452.28
Organism:Homo sapiens (Human)
Description:P14780
Residue:707
BDBM50088128
NameBDBM50088128
Synonyms:2-(N-(4-nitrobenzyl)-4,4,12,12,15,15,18,18,18-nonafluorobutan-4-ylsulfonamido)-N-hydroxyacetamide N-Hydroxy-2-[(4-nitro-benzyl)-(nonafluorobutane-1-sulfonyl)-amino]-acetamide
TypeSmall organic molecule
Emp. Form.C13H10F9N3O6S
Mol. Mass.507.286
SMILESONC(=O)CN(Cc1ccc(cc1)[N+]([O-])=O)S(=O)(=O)C(F)(F)C(F)(F)C(F)(F)C(F)(F)F