Reaction Details
Target72 kDa type IV collagenase
LigandBDBM50100812
Substrate/Competitorn/a
Meas. Tech.ChEMBL_458931 (CHEMBL924950)
Ki 0.794000±n/a nM
Citation Verma, RPHansch, C Matrix metalloproteinases (MMPs): chemical-biological functions and (Q)SARs. Bioorg Med Chem15:2223-68 (2007) 
 
72 kDa type IV collagenase
Name:72 kDa type IV collagenase
Type:Enzyme
Mol. Mass.:73870.36
Organism:Homo sapiens (Human)
Description: P08253
Residue:660
BDBM50100812
NameBDBM50100812
Synonyms:2-(N-(2-nitrobenzyl)-2,3,4,5,6-pentafluorophenylsulfonamido)-N-hydroxypropanamide N-Hydroxy-2-[(2-nitro-benzyl)-pentafluorobenzenesulfonyl-amino]-propionamide
TypeSmall organic molecule
Emp. Form.C16H12F5N3O6S
Mol. Mass.469.34
SMILESCC(N(Cc1ccccc1[N+]([O-])=O)S(=O)(=O)c1c(F)c(F)c(F)c(F)c1F)C(=O)NO