Reaction Details
Target72 kDa type IV collagenase
LigandBDBM50423402
Substrate/Competitorn/a
Meas. Tech.ChEMBL_458931 (CHEMBL924950)
Ki 1.4±n/a nM
Citation Verma, RPHansch, C Matrix metalloproteinases (MMPs): chemical-biological functions and (Q)SARs. Bioorg Med Chem15:2223-68 (2007) 
 
72 kDa type IV collagenase
Name:72 kDa type IV collagenase
Type:Enzyme
Mol. Mass.:73870.36
Organism:Homo sapiens (Human)
Description: P08253
Residue:660
BDBM50423402
NameBDBM50423402
Synonyms:CHEMBL122711
TypeSmall organic molecule
Emp. Form.C15H10F5N3O6S
Mol. Mass.455.313
SMILESONC(=O)CN(Cc1ccccc1[N+]([O-])=O)S(=O)(=O)c1c(F)c(F)c(F)c(F)c1F