Reaction Details
TargetMatrix metalloproteinase-9
LigandBDBM11329
Substrate/Competitorn/a
Meas. Tech.ChEMBL_458932 (CHEMBL924951)
Ki 5.0±n/a nM
Citation Verma, RPHansch, C Matrix metalloproteinases (MMPs): chemical-biological functions and (Q)SARs. Bioorg Med Chem15:2223-68 (2007) 
 
Matrix metalloproteinase-9
Name:Matrix metalloproteinase-9
Type:Enzyme
Mol. Mass.:78452.28
Organism:Homo sapiens (Human)
Description:P14780
Residue:707
BDBM11329
NameBDBM11329
Synonyms:2-[benzyl(1,1,2,2,3,3,4,4,4-nonafluorobutane)sulfonamido]-N-hydroxyacetamide | Hydroxamate 10
TypeSmall organic molecule
Emp. Form.C13H11F9N2O4S
Mol. Mass.462.288
SMILESONC(=O)CN(Cc1ccccc1)S(=O)(=O)C(F)(F)C(F)(F)C(F)(F)C(F)(F)F