Reaction Details
Target72 kDa type IV collagenase
LigandBDBM50100798
Substrate/Competitorn/a
Meas. Tech.ChEMBL_458931 (CHEMBL924950)
Ki 2.9±n/a nM
Citation Verma, RPHansch, C Matrix metalloproteinases (MMPs): chemical-biological functions and (Q)SARs. Bioorg Med Chem15:2223-68 (2007) 
 
72 kDa type IV collagenase
Name:72 kDa type IV collagenase
Type:Enzyme
Mol. Mass.:73870.36
Organism:Homo sapiens (Human)
Description: P08253
Residue:660
BDBM50100798
NameBDBM50100798
Synonyms:2-(N-(2-nitrobenzyl)-2,2,12,12,15,15,18,18,18-nonafluorobutan-2-ylsulfonamido)-N-hydroxypropanamide N-Hydroxy-2-[(2-nitro-benzyl)-(nonafluorobutane-1-sulfonyl)-amino]-propionamide
TypeSmall organic molecule
Emp. Form.C14H12F9N3O6S
Mol. Mass.521.312
SMILESCC(N(Cc1ccccc1[N+]([O-])=O)S(=O)(=O)C(F)(F)C(F)(F)C(F)(F)C(F)(F)F)C(=O)NO