Reaction Details
TargetCollagenase 3
LigandBDBM30359
Substrate/Competitorn/a
Meas. Tech.ChEMBL_458933 (CHEMBL924952)
IC50 0.398000±n/a nM
Citation Verma, RPHansch, C Matrix metalloproteinases (MMPs): chemical-biological functions and (Q)SARs. Bioorg Med Chem15:2223-68 (2007) 
 
Collagenase 3
Name:Collagenase 3
Type:Enzyme
Mol. Mass.:53808.06
Organism:Homo sapiens (Human)
Description:P45452
Residue:471
BDBM30359
NameBDBM30359
Synonyms:BOC-piperidinyl glycine derivative, 34
TypeSmall organic molecule
Emp. Form.C25H32N2O7S
Mol. Mass.504.596
SMILESCOc1ccc(cc1)-c1ccc(cc1)S(=O)(=O)N[C@H](C1CCN(CC1)C(=O)OC(C)(C)C)C(O)=O