Reaction Details
TargetSex hormone-binding globulin
LigandBDBM50080092
Substrate/Competitorn/a
Meas. Tech.ChEMBL_466706 (CHEMBL922711)
Kd 501±n/a nM
Citation Cherkasov, ABan, FSantos-Filho, OThorsteinson, NFallahi, MHammond, GL An updated steroid benchmark set and its application in the discovery of novel nanomolar ligands of sex hormone-binding globulin. J Med Chem51:2047-56 (2008) 
 
Sex hormone-binding globulin
Name:Sex hormone-binding globulin
Type:PROTEIN
Mol. Mass.:43780.19
Organism:Homo sapiens (Human)
Description:ChEMBL_466706
Residue:402
BDBM50080092
NameBDBM50080092
Synonyms:(17beta)-17-hydroxyestr-4-en-3-one 17beta-hydroxy-4-estren-3-one 19-Norandrostenolone 4-estren-17beta-ol-3-one Nandrolone
TypeSmall organic molecule
Emp. Form.C18H26O2
Mol. Mass.274.3978
SMILESC[C@]12CC[C@H]3[C@@H](CCC4=CC(=O)CC[C@H]34)[C@@H]1CC[C@@H]2O