Reaction Details
TargetSex hormone-binding globulin
LigandBDBM8885
Substrate/Competitorn/a
Meas. Tech.ChEMBL_466706 (CHEMBL922711)
Kd 0.631000±n/a nM
Citation Cherkasov, ABan, FSantos-Filho, OThorsteinson, NFallahi, MHammond, GL An updated steroid benchmark set and its application in the discovery of novel nanomolar ligands of sex hormone-binding globulin. J Med Chem51:2047-56 (2008) 
 
Sex hormone-binding globulin
Name:Sex hormone-binding globulin
Type:PROTEIN
Mol. Mass.:43780.19
Organism:Homo sapiens (Human)
Description:ChEMBL_466706
Residue:402
BDBM8885
NameBDBM8885
Synonyms:(1S,2R,10R,11S,14S,15S)-14-hydroxy-2,15-dimethyltetracyclo[8.7.0.0^{2,7}.0^{11,15}]heptadec-6-en-5-one Testosterone US9682960, Testosterone
TypeSteroid
Emp. Form.C19H28O2
Mol. Mass.288.4244
SMILES[H][C@@]12CC[C@H](O)[C@@]1(C)CC[C@@]1([H])[C@@]2([H])CCC2=CC(=O)CC[C@]12C