Reaction Details
TargetProstaglandin E2 receptor EP1 subtype
LigandBDBM50197898
Substrate/Competitorn/a
Meas. Tech.ChEMBL_468124 (CHEMBL934144)
IC50 2.5±n/a nM
Citation Hall, ABit, RABrown, SHChowdhury, AGiblin, GMHurst, DNKilford, IRLewell, XNaylor, AScoccitti, T Novel methylene-linked heterocyclic EP1 receptor antagonists. Bioorg Med Chem Lett18:1592-7 (2008) 
 
Prostaglandin E2 receptor EP1 subtype
Name:Prostaglandin E2 receptor EP1 subtype
Type:Enzyme
Mol. Mass.:41834.57
Organism:Homo sapiens (Human)
Description:P34995
Residue:402
BDBM50197898
NameBDBM50197898
Synonyms:6-(2-(2-(2,4-difluorobenzyloxy)-5-chlorophenyl)cyclopent-1-enyl)picolinic acid CHEMBL234940
TypeSmall organic molecule
Emp. Form.C24H18ClF2NO3
Mol. Mass.441.854
SMILESOC(=O)c1cccc(n1)C1=C(CCC1)c1cc(Cl)ccc1OCc1ccc(F)cc1F