Reaction Details
TargetUrease
LigandBDBM35525
Substrate/Competitorn/a
Meas. Tech.ChEMBL_478538 (CHEMBL923500)
IC50 15136±n/a nM
Citation Zaheer-ul-Haq, naLodhi, MAAhmad Nawaz, SIqbal, SMohammed Khan, KRode, BMAtta-ur-Rahman, AChoudhary, MI 3D-QSAR CoMFA studies on bis-coumarine analogues as urease inhibitors: a strategic design in anti-urease agents. Bioorg Med Chem16:3456-61 (2008) 
 
Urease
Name:Urease
Type:Enzyme
Mol. Mass.:90746.20
Organism:Canavalia ensiformis (Jack bean) (Horse bean)
Description:P07374
Residue:840
BDBM35525
NameBDBM35525
Synonyms:3,3''''-methylenebis(4-hydroxy-coumarin 3,3''''-methylenebis[4-hydroxycoumarin Bishydroxycoumarin DICUMAROL symmetric dicoumarol analogue, 1
TypeSmall organic molecule
Emp. Form.C19H12O6
Mol. Mass.336.295
SMILESOc1c(Cc2c(O)c3ccccc3oc2=O)c(=O)oc2ccccc12