Reaction Details
TargetIntegrin alpha-4/beta-1
LigandBDBM50423692
Substrate/Competitorn/a
Meas. Tech.ChEMBL_599864 (CHEMBL1043647)
IC50 81±n/a nM
Citation Venkatraman, SLebsack, ADAlves, KGardner, MFJames, JLingham, RBManiar, SMumford, RASi, QStock, NTreonze, KMWang, BZunic, JMunoz, B Discovery of N-{N-[(3-cyanobenzene) sulfonyl]-4(R)-(3,3-difluoropiperidin-1-yl)-(l)-prolyl}-4-[(3',5'-dichloro-isonicotinoyl) amino]-(l)-phenylalanine (MK-0617), a highly potent and orally active VLA-4 antagonist. Bioorg Med Chem Lett19:5803-6 (2009) 
 
Integrin alpha-4/beta-1
Name:Integrin alpha-4/beta-1
Type:n/a
Mol. Mass.:n/a
Description:ASSAY_ID of EBI is 88912
Components:This complex has 2 components.
Component 1
Name:Integrin beta-1
Synonyms:CD_antigen=CD29 Fibronectin receptor beta GPIIA ITGB1 MDF2 | MSK12
Type:Enzyme
Mol. Mass.:88400.38
Organism:Homo sapiens (Human)
Description:P05556
Residue:798
Component 2
Name:Integrin alpha-4
Synonyms:CD49 antigen-like family member D CD49d antigen ITA4_HUMAN Integrin alpha-4 Integrin alpha-IV VLA-4 integrin alpha 4 precursor | integrin alpha-4 precursor
Type:Membrane Protein
Mol. Mass.:114897.35
Organism:Homo sapiens (Human)
Description:P13612
Residue:1032
BDBM50423692
NameBDBM50423692
Synonyms:CHEMBL569443
TypeSmall organic molecule
Emp. Form.C31H28Cl2F2N6O6S
Mol. Mass.721.558
SMILESOC(=O)[C@H](Cc1ccc(NC(=O)c2c(Cl)cncc2Cl)cc1)NC(=O)[C@@H]1C[C@H](CN1S(=O)(=O)c1cccc(c1)C#N)N1CCC(F)(F)C1