Reaction Details
TargetIntegrin alpha-V/beta-3
LigandBDBM50423749
Substrate/Competitorn/a
Meas. Tech.ChEMBL_610945 (CHEMBL1069664)
Ki 2.9±n/a nM
Citation Olberg, DEArukwe, JMGrace, DHjelstuen, OKSolbakken, MKindberg, GMCuthbertson, A One step radiosynthesis of 6-[(18)F]fluoronicotinic acid 2,3,5,6-tetrafluorophenyl ester ([(18)F]F-Py-TFP): a new prosthetic group for efficient labeling of biomolecules with fluorine-18. J Med Chem53:1732-40 (2010) 
 
Integrin alpha-V/beta-3
Name:Integrin alpha-V/beta-3
Type:Enzyme
Mol. Mass.:n/a
Description:n/a
Components:This complex has 2 components.
Component 1
Name:Integrin alpha-V
Synonyms:ITAV_HUMAN Integrin alpha-V/alpha-5 VNRA Vitronectin receptor | Vitronectin receptor subunit alpha
Type:PROTEIN
Mol. Mass.:116024.92
Organism:Homo sapiens (Human)
Description:ChEMBL_582336
Residue:1048
Component 2
Name:Integrin beta-3
Synonyms:CD_antigen=CD61 GPIIIa ITGB3 Platelet membrane glycoprotein IIIa
Type:Protein
Mol. Mass.:87038.91
Organism:Homo sapiens (Human)
Description:P05106
Residue:788
BDBM50423749
NameBDBM50423749
Synonyms:CHEMBL600858
TypeSmall organic molecule
Emp. Form.C57H82FN15O18S3
Mol. Mass.1380.544
SMILES[#7]-[#6](=O)-[#6]-[#8]-[#6]-[#6](=O)-[#7]-[#6]-[#6]-[#8]-[#6]-[#6]-[#8]-[#6]-[#6]-[#8]-[#6]-[#6]-[#7]-[#6](=O)-[#6@@H]-1-[#6]-[#16]-[#6]-[#6](=O)-[#7]-[#6@@H](-[#6]-[#6]-[#6]-[#6]-[#7]-[#6](=O)-c2ccc(F)nc2)-[#6](=O)-[#7]-[#6@H]-2-[#6]-[#16]-[#16]-[#6]-[#6@H](-[#7]-[#6](=O)-[#6@H](-[#6]-[#6](-[#8])=O)-[#7]-[#6](=O)-[#6]-[#7]-[#6](=O)-[#6@H](-[#6]-[#6]-[#6]\[#7]=[#6](\[#7])-[#7])-[#7]-[#6]-2=O)-[#6](=O)-[#7]-[#6@@H](-[#6]-c2ccccc2)-[#6](=O)-[#6]-1