Reaction Details
TargetCarbonic anhydrase 2
LigandBDBM50025093
Substrate/Competitorn/a
Meas. Tech.ChEMBL_698608 (CHEMBL1647881)
Ki 14±n/a nM
Citation Munei, YShimamoto, KHarada, MYoshida, TChuman, H Correlation analyses on binding affinity of substituted benzenesulfonamides with carbonic anhydrase using ab initio MO calculations on their complex structures (II). Bioorg Med Chem Lett21:141-4 (2010) 
 
Carbonic anhydrase 2
Name:Carbonic anhydrase 2
Type:Enzyme Catalytic Domain
Mol. Mass.:29115.93
Organism:Bos taurus
Description:n/a
Residue:260
BDBM50025093
NameBDBM50025093
Synonyms:4-Chloro-benzenesulfonamide P-Chlorobenzenesulfonamide | p-Halide-sulfanilamide derivative, 2
TypeSmall organic molecule
Emp. Form.C6H6ClNO2S
Mol. Mass.191.635
SMILESNS(=O)(=O)c1ccc(Cl)cc1