Reaction Details
TargetCarbonic anhydrase 2
LigandBDBM50415863
Substrate/Competitorn/a
Meas. Tech.ChEMBL_698609 (CHEMBL1647882)
Ki 0.05±n/a nM
Citation Munei, YShimamoto, KHarada, MYoshida, TChuman, H Correlation analyses on binding affinity of substituted benzenesulfonamides with carbonic anhydrase using ab initio MO calculations on their complex structures (II). Bioorg Med Chem Lett21:141-4 (2010) 
 
Carbonic anhydrase 2
Name:Carbonic anhydrase 2
Type:Enzyme
Mol. Mass.:29250.71
Organism:Homo sapiens (Human)
Description:P00918
Residue:260
BDBM50415863
NameBDBM50415863
Synonyms:CHEMBL358263
TypeSmall organic molecule
Emp. Form.C8H11NO2S
Mol. Mass.185.243
SMILESCCc1ccc(cc1)S(N)(=O)=O