Reaction Details
TargetDynamin-2
LigandBDBM50423884
Substrate/Competitorn/a
Meas. Tech.ChEMBL_934670 (CHEMBL2318140)
IC50 6800±n/a nM
Citation Gordon, CPVenn-Brown, BRobertson, MJYoung, KAChau, NMariana, AWhiting, AChircop, MRobinson, PJMcCluskey, A Development of second-generation indole-based dynamin GTPase inhibitors. J Med Chem56:46-59 (2013) 
 
Dynamin-2
Name:Dynamin-2
Type:PROTEIN
Mol. Mass.:98071.19
Organism:Homo sapiens (Human)
Description:ChEMBL_934670
Residue:870
BDBM50423884
NameBDBM50423884
Synonyms:CHEMBL2312432
TypeSmall organic molecule
Emp. Form.C28H49N3
Mol. Mass.427.7088
c1cn(CCCN(C)C)c2ccccc12