Reaction Details
TargetDynamin-2
LigandBDBM50423887
Substrate/Competitorn/a
Meas. Tech.ChEMBL_934670 (CHEMBL2318140)
IC50 4500±n/a nM
Citation Gordon, CPVenn-Brown, BRobertson, MJYoung, KAChau, NMariana, AWhiting, AChircop, MRobinson, PJMcCluskey, A Development of second-generation indole-based dynamin GTPase inhibitors. J Med Chem56:46-59 (2013) 
 
Dynamin-2
Name:Dynamin-2
Type:PROTEIN
Mol. Mass.:98071.19
Organism:Homo sapiens (Human)
Description:ChEMBL_934670
Residue:870
BDBM50423887
NameBDBM50423887
Synonyms:CHEMBL2312415
TypeSmall organic molecule
Emp. Form.C28H40N4O2
Mol. Mass.464.6428
SMILESCCCCCCCCNC(=O)C(=C\c1c(C)n(CC(O)CN2CCCC2)c2ccccc12)\C#N