Reaction Details
TargetMyc proto-oncogene protein
LigandBDBM50423921
Substrate/Competitorn/a
Meas. Tech.ChEMBL_935266 (CHEMBL2318156)
IC50 146000±n/a nM
Citation Yap, JLWang, HHu, AChauhan, JJung, KYGharavi, RBProchownik, EVFletcher, S Pharmacophore identification of c-Myc inhibitor 10074-G5. Bioorg Med Chem Lett23:370-4 (2012) 
 
Myc proto-oncogene protein
Name:Myc proto-oncogene protein
Type:PROTEIN
Mol. Mass.:48794.95
Organism:Homo sapiens (Human)
Description:ChEMBL_935266
Residue:439
BDBM50423921
NameBDBM50423921
Synonyms:CHEMBL2312756
TypeSmall organic molecule
Emp. Form.C18H12N4O3
Mol. Mass.332.3129
SMILES[O-][N+](=O)c1ccc(Nc2ccccc2-c2ccccc2)c2nonc12