Reaction Details
TargetXanthine dehydrogenase/oxidase
LigandBDBM50423925
Substrate/Competitorn/a
Meas. Tech.ChEMBL_935552 (CHEMBL2320088)
IC50>50000±n/a nM
Citation Mandawad, GGDawane, BSBeedkar, SDKhobragade, CNYemul, OS Trisubstituted thiophene analogues of 1-thiazolyl-2-pyrazoline, super oxidase inhibitors and free radical scavengers. Bioorg Med Chem21:365-72 (2012) 
 
Xanthine dehydrogenase/oxidase
Name:Xanthine dehydrogenase/oxidase
Type:PROTEIN
Mol. Mass.:146252.77
Organism:Rattus norvegicus
Description:ChEMBL_1296864
Residue:1331
BDBM50423925
NameBDBM50423925
Synonyms:CHEMBL2313038
TypeSmall organic molecule
Emp. Form.C22H15Cl2FN4O2S3
Mol. Mass.553.48
SMILESNS(=O)(=O)c1sc(Cl)cc1C1=NN(C(C1)c1ccc(F)cc1)c1nc(cs1)-c1ccc(Cl)cc1