Reaction Details
TargetXanthine dehydrogenase/oxidase
LigandBDBM50423927
Substrate/Competitorn/a
Meas. Tech.ChEMBL_935552 (CHEMBL2320088)
IC50>50000±n/a nM
Citation Mandawad, GGDawane, BSBeedkar, SDKhobragade, CNYemul, OS Trisubstituted thiophene analogues of 1-thiazolyl-2-pyrazoline, super oxidase inhibitors and free radical scavengers. Bioorg Med Chem21:365-72 (2012) 
 
Xanthine dehydrogenase/oxidase
Name:Xanthine dehydrogenase/oxidase
Type:PROTEIN
Mol. Mass.:146252.77
Organism:Rattus norvegicus
Description:ChEMBL_1296864
Residue:1331
BDBM50423927
NameBDBM50423927
Synonyms:CHEMBL2313036
TypeSmall organic molecule
Emp. Form.C22H13Cl3FN3S2
Mol. Mass.508.846
SMILESFc1ccc(cc1)C1CC(=NN1c1nc(cs1)-c1ccc(Cl)cc1)c1cc(Cl)sc1Cl