Reaction Details
TargetXanthine dehydrogenase/oxidase
LigandBDBM50423929
Substrate/Competitorn/a
Meas. Tech.ChEMBL_935552 (CHEMBL2320088)
IC50 32000±n/a nM
Citation Mandawad, GGDawane, BSBeedkar, SDKhobragade, CNYemul, OS Trisubstituted thiophene analogues of 1-thiazolyl-2-pyrazoline, super oxidase inhibitors and free radical scavengers. Bioorg Med Chem21:365-72 (2012) 
 
Xanthine dehydrogenase/oxidase
Name:Xanthine dehydrogenase/oxidase
Type:PROTEIN
Mol. Mass.:146252.77
Organism:Rattus norvegicus
Description:ChEMBL_1296864
Residue:1331
BDBM50423929
NameBDBM50423929
Synonyms:CHEMBL2313034
TypeSmall organic molecule
Emp. Form.C29H20Cl3N3S3
Mol. Mass.613.043
SMILESClc1cc(C2=NN(C(C2)c2ccc(Cl)cc2)c2nc(cs2)-c2ccc(Cl)cc2)c(SCc2ccccc2)s1