Reaction Details
TargetXanthine dehydrogenase/oxidase
LigandBDBM50423932
Substrate/Competitorn/a
Meas. Tech.ChEMBL_935552 (CHEMBL2320088)
IC50 20000±n/a nM
Citation Mandawad, GGDawane, BSBeedkar, SDKhobragade, CNYemul, OS Trisubstituted thiophene analogues of 1-thiazolyl-2-pyrazoline, super oxidase inhibitors and free radical scavengers. Bioorg Med Chem21:365-72 (2012) 
 
Xanthine dehydrogenase/oxidase
Name:Xanthine dehydrogenase/oxidase
Type:PROTEIN
Mol. Mass.:146252.77
Organism:Rattus norvegicus
Description:ChEMBL_1296864
Residue:1331
BDBM50423932
NameBDBM50423932
Synonyms:CHEMBL2313031
TypeSmall organic molecule
Emp. Form.C30H26Cl3N5S3
Mol. Mass.659.115
SMILESCCCCc1nc(Cl)c([nH]1)C1CC(=NN1c1nc(cs1)-c1ccc(Cl)cc1)c1cc(Cl)sc1SCc1ccccc1