Reaction Details
TargetMuscarinic acetylcholine receptor M4
LigandBDBM50423968
Substrate/Competitorn/a
Meas. Tech.ChEMBL_935591 (CHEMBL2320373)
EC50 77±n/a nM
Citation Le, UMelancon, BJBridges, TMVinson, PNUtley, TJLamsal, ARodriguez, ALVenable, DSheffler, DJJones, CKBlobaum, ALWood, MRDaniels, JSConn, PJNiswender, CMLindsley, CWHopkins, CR Discovery of a selective M4 positive allosteric modulator based on the 3-amino-thieno[2,3-b]pyridine-2-carboxamide scaffold: development of ML253, a potent and brain penetrant compound that is active in a preclinical model of schizophrenia. Bioorg Med Chem Lett23:346-50 (2012) 
 
Muscarinic acetylcholine receptor M4
Name:Muscarinic acetylcholine receptor M4
Type:Enzyme Catalytic Domain
Mol. Mass.:53079.31
Organism:Homo sapiens (Human)
Description:Cholinergic, muscarinic M4 CHRM4 HUMAN M3::P08173
Residue:479
BDBM50423968
NameBDBM50423968
Synonyms:CHEMBL2313377
TypeSmall organic molecule
Emp. Form.C13H14ClN3OS
Mol. Mass.295.788
SMILESCc1nc2sc(C(=O)NC3CC3)c(N)c2c(C)c1Cl