Reaction Details
TargetMuscarinic acetylcholine receptor M4
LigandBDBM48043
Substrate/Competitorn/a
Meas. Tech.ChEMBL_935589 (CHEMBL2320371)
EC50 230±n/a nM
Citation Le, UMelancon, BJBridges, TMVinson, PNUtley, TJLamsal, ARodriguez, ALVenable, DSheffler, DJJones, CKBlobaum, ALWood, MRDaniels, JSConn, PJNiswender, CMLindsley, CWHopkins, CR Discovery of a selective M4 positive allosteric modulator based on the 3-amino-thieno[2,3-b]pyridine-2-carboxamide scaffold: development of ML253, a potent and brain penetrant compound that is active in a preclinical model of schizophrenia. Bioorg Med Chem Lett23:346-50 (2012) 
 
Muscarinic acetylcholine receptor M4
Name:Muscarinic acetylcholine receptor M4
Type:Enzyme Catalytic Domain
Mol. Mass.:52841.70
Organism:RAT
Description:Cholinergic, muscarinic M4 CHRM4 RAT::P08485
Residue:477
BDBM48043
NameBDBM48043
Synonyms:3-amino-4,6-dimethyl-N-p-anisyl-thieno[2,3-b]pyridine-2-carboxamide 3-amino-N-[(4-methoxyphenyl)methyl]-4,6-dimethylthieno[2,3-b]pyridine-2-carboxamide ML108 cid_864492
TypeSmall organic molecule
Emp. Form.C18H19N3O2S
Mol. Mass.341.427
SMILESCOc1ccc(CNC(=O)c2sc3nc(C)cc(C)c3c2N)cc1