Reaction Details
TargetEmopamil-binding protein-like
LigandBDBM79181
Substrate/Competitorn/a
Meas. Tech.ChEMBL_936215 (CHEMBL2320419)
Ki 3.9±n/a nM
Citation Wang, XLi, YDeuther-Conrad, WXie, FChen, XCui, MCZhang, XJZhang, JMSteinbach, JBrust, PLiu, BLJia, HM Synthesis and biological evaluation of¹8F labeled fluoro-oligo-ethoxylated 4-benzylpiperazine derivatives for sigma-1 receptor imaging. Bioorg Med Chem21:215-22 (2012) 
 
Emopamil-binding protein-like
Name:Emopamil-binding protein-like
Type:PROTEIN
Mol. Mass.:23203.44
Organism:Homo sapiens (Human)
Description:ChEMBL_936215
Residue:206
BDBM79181
NameBDBM79181
Synonyms:10-[3-(4-methyl-1-piperazinyl)propyl]-2-(trifluoromethyl)phenothiazine;hydrochloride 10-[3-(4-methylpiperazino)propyl]-2-(trifluoromethyl)phenothiazine;hydrochloride SMR000059133 TRIFLUOPERAZINE DIHYDROCHLORIDE US11542290, Compound Trifluoperazine cid_5566
TypeSmall organic molecule
Emp. Form.C21H24F3N3S
Mol. Mass.407.496
SMILESCN1CCN(CCCN2c3ccccc3Sc3ccc(cc23)C(F)(F)F)CC1