Reaction Details
TargetCholinesterase
LigandBDBM50424042
Substrate/Competitorn/a
Meas. Tech.ChEMBL_936731 (CHEMBL2319647)
IC50 3900±n/a nM
Citation Catto, MPisani, LLeonetti, FNicolotti, OPesce, PStefanachi, ACellamare, SCarotti, A Design, synthesis and biological evaluation of coumarin alkylamines as potent and selective dual binding site inhibitors of acetylcholinesterase. Bioorg Med Chem21:146-52 (2012) 
 
Cholinesterase
Name:Cholinesterase
Type:Enzyme
Mol. Mass.:65643.35
Organism:Equus caballus (Horse)
Description:P81908
Residue:574
BDBM50424042
NameBDBM50424042
Synonyms:CHEMBL2314731
TypeSmall organic molecule
Emp. Form.C24H27NO5
Mol. Mass.409.4749
SMILESCOc1cc2cc(OCC3CCN(Cc4ccccc4)CC3)c(=O)oc2cc1OC