Reaction Details
TargetAcetylcholinesterase
LigandBDBM50424053
Substrate/Competitorn/a
Meas. Tech.ChEMBL_936732 (CHEMBL2319648)
IC50 26000±n/a nM
Citation Catto, MPisani, LLeonetti, FNicolotti, OPesce, PStefanachi, ACellamare, SCarotti, A Design, synthesis and biological evaluation of coumarin alkylamines as potent and selective dual binding site inhibitors of acetylcholinesterase. Bioorg Med Chem21:146-52 (2012) 
 
Acetylcholinesterase
Name:Acetylcholinesterase
Type:Enzyme
Mol. Mass.:67659.62
Organism:Bos taurus (bovine)
Description:n/a
Residue:613
BDBM50424053
NameBDBM50424053
Synonyms:CHEMBL2314722
TypeSmall organic molecule
Emp. Form.C21H22N2O5
Mol. Mass.382.4098
SMILESCOc1cc2cc(NC(=O)CN(C)Cc3ccccc3)c(=O)oc2cc1OC