Reaction Details
TargetAcetylcholinesterase
LigandBDBM50424046
Substrate/Competitorn/a
Meas. Tech.ChEMBL_936732 (CHEMBL2319648)
IC50 73±n/a nM
Citation Catto, MPisani, LLeonetti, FNicolotti, OPesce, PStefanachi, ACellamare, SCarotti, A Design, synthesis and biological evaluation of coumarin alkylamines as potent and selective dual binding site inhibitors of acetylcholinesterase. Bioorg Med Chem21:146-52 (2012) 
 
Acetylcholinesterase
Name:Acetylcholinesterase
Type:Enzyme
Mol. Mass.:67659.62
Organism:Bos taurus (bovine)
Description:n/a
Residue:613
BDBM50424046
NameBDBM50424046
Synonyms:CHEMBL2314721
TypeSmall organic molecule
Emp. Form.C25H27NO6
Mol. Mass.437.485
SMILESCOc1cc2cc(C(=O)OCC3CCN(Cc4ccccc4)CC3)c(=O)oc2cc1OC