Reaction Details
TargetKappa-type opioid receptor
LigandBDBM50424113
Substrate/Competitorn/a
Meas. Tech.ChEMBL_937278 (CHEMBL2318807)
EC50 11±n/a nM
Citation Nemoto, TYamamoto, NWada, NHarada, YTomatsu, MIshihara, MHirayama, SIwai, TFujii, HNagase, H The effect of 17-N substituents on the activity of the opioid¿ receptor in nalfurafine derivatives. Bioorg Med Chem Lett23:268-72 (2012) 
 
Kappa-type opioid receptor
Name:Kappa-type opioid receptor
Type:G Protein-Coupled Receptor (GPCR)
Mol. Mass.:42648.76
Organism:Homo sapiens (Human)
Description:P41145
Residue:380
BDBM50424113
NameBDBM50424113
Synonyms:CHEMBL2315362
TypeSmall organic molecule
Emp. Form.C24H30N2O5
Mol. Mass.426.5054
SMILESCN(CCC[C@@]1(O)[C@H]2Cc3ccc(O)c(O)c3[C@@H]1CCN2C)C(=O)\C=C\c1ccoc1