Reaction Details
TargetKappa-type opioid receptor
LigandBDBM50424112
Substrate/Competitorn/a
Meas. Tech.ChEMBL_937281 (CHEMBL2318810)
Ki 0.625000±n/a nM
Citation Nemoto, TYamamoto, NWada, NHarada, YTomatsu, MIshihara, MHirayama, SIwai, TFujii, HNagase, H The effect of 17-N substituents on the activity of the opioid¿ receptor in nalfurafine derivatives. Bioorg Med Chem Lett23:268-72 (2012) 
 
Kappa-type opioid receptor
Name:Kappa-type opioid receptor
Type:G Protein-Coupled Receptor (GPCR)
Mol. Mass.:42744.99
Organism:Cavia porcellus (domestic guinea pig)
Description:P41144
Residue:380
BDBM50424112
NameBDBM50424112
Synonyms:CHEMBL2315361
TypeSmall organic molecule
Emp. Form.C25H32N2O5
Mol. Mass.440.532
SMILESCCN1CC[C@H]2c3c(C[C@@H]1[C@]2(O)CCCN(C)C(=O)\C=C\c1ccoc1)ccc(O)c3O