Reaction Details
TargetDelta-type opioid receptor
LigandBDBM50424108
Substrate/Competitorn/a
Meas. Tech.ChEMBL_937282 (CHEMBL2318811)
Ki>1000±n/a nM
Citation Nemoto, TYamamoto, NWada, NHarada, YTomatsu, MIshihara, MHirayama, SIwai, TFujii, HNagase, H The effect of 17-N substituents on the activity of the opioid¿ receptor in nalfurafine derivatives. Bioorg Med Chem Lett23:268-72 (2012) 
 
Delta-type opioid receptor
Name:Delta-type opioid receptor
Type:Enzyme Catalytic Domain
Mol. Mass.:40577.25
Organism:MOUSE
Description:P32300
Residue:372
BDBM50424108
NameBDBM50424108
Synonyms:CHEMBL2315357
TypeSmall organic molecule
Emp. Form.C25H30F2N2O5
Mol. Mass.476.5129
SMILESCN(CCC[C@@]1(O)[C@H]2Cc3ccc(O)c(O)c3[C@@H]1CCN2CC(F)F)C(=O)\C=C\c1ccoc1