Reaction Details
TargetInterleukin-5
LigandBDBM50424133
Substrate/Competitorn/a
Meas. Tech.ChEMBL_937647 (CHEMBL2321339)
IC50 12500±n/a nM
Citation Venkateswararao, EKim, MSSharma, VKLee, KCSubramanian, SRoh, EKim, YJung, SH Identification of novel chromenone derivatives as interleukin-5 inhibitors. Eur J Med Chem59:31-8 (2013) 
 
Interleukin-5
Name:Interleukin-5
Type:PROTEIN
Mol. Mass.:15414.97
Organism:Mus musculus
Description:ChEMBL_1464308
Residue:133
BDBM50424133
NameBDBM50424133
Synonyms:CHEMBL2316373
TypeSmall organic molecule
Emp. Form.C25H26O5
Mol. Mass.406.4709
SMILESOC(\C=C\c1coc2cccc(OCC3CCCCC3)c2c1=O)c1ccc(O)cc1