Reaction Details
TargetBcl-2-like protein 1
LigandBDBM50424212
Substrate/Competitorn/a
Meas. Tech.ChEMBL_934032 (CHEMBL2318339)
IC50 43±n/a nM
Citation Song, TLi, XChang, XLiang, XZhao, YWu, GXie, SSu, PWu, ZFeng, YZhang, Z 3-Thiomorpholin-8-oxo-8H-acenaphtho [1,2-b] pyrrole-9-carbonitrile (S1) derivatives as pan-Bcl-2-inhibitors of Bcl-2, Bcl-xL and Mcl-1. Bioorg Med Chem21:11-20 (2012) 
 
Bcl-2-like protein 1
Name:Bcl-2-like protein 1
Type:Mitochondrion membrane; Single-pass membrane protein
Mol. Mass.:26039.60
Organism:Homo sapiens (Human)
Description:n/a
Residue:233
BDBM50424212
NameBDBM50424212
Synonyms:CHEMBL2312483
TypeSmall organic molecule
Emp. Form.C27H25N3OS
Mol. Mass.439.572
SMILESO=c1nc2c3cccc4c(ccc(c2c1NCCCc1ccccc1)c34)N1CCSCC1