Reaction Details
TargetApoptosis regulator Bcl-2
LigandBDBM50424203
Substrate/Competitorn/a
Meas. Tech.ChEMBL_934034 (CHEMBL2318341)
IC50 42±n/a nM
Citation Song, TLi, XChang, XLiang, XZhao, YWu, GXie, SSu, PWu, ZFeng, YZhang, Z 3-Thiomorpholin-8-oxo-8H-acenaphtho [1,2-b] pyrrole-9-carbonitrile (S1) derivatives as pan-Bcl-2-inhibitors of Bcl-2, Bcl-xL and Mcl-1. Bioorg Med Chem21:11-20 (2012) 
 
Apoptosis regulator Bcl-2
Name:Apoptosis regulator Bcl-2
Type:Homodimer or heterodimer
Mol. Mass.:26269.11
Organism:Homo sapiens (Human)
Description:P10415
Residue:239
BDBM50424203
NameBDBM50424203
Synonyms:CHEMBL2312476
TypeSmall organic molecule
Emp. Form.C32H28N2O2
Mol. Mass.472.5769
SMILESCC(C)c1ccc(Oc2ccc3c4c(NCCCc5ccccc5)c(=O)nc4c4cccc2c34)cc1