Reaction Details
TargetRicin
LigandBDBM50424231
Substrate/Competitorn/a
Meas. Tech.ChEMBL_934991 (CHEMBL2320360)
IC50 22000±n/a nM
Citation Saito, RPruet, JMManzano, LAJasheway, KMonzingo, AFWiget, PAKamat, IAnslyn, EVRobertus, JD Peptide-conjugated pterins as inhibitors of ricin toxin A. J Med Chem56:320-9 (2013) 
 
Ricin
Name:Ricin
Synonyms:RICI_RICCO
Type:PROTEIN
Mol. Mass.:64090.82
Organism:Ricinus communis
Description:ChEMBL_1286970
Residue:576
BDBM50424231
NameBDBM50424231
Synonyms:CHEMBL2314134
TypeSmall organic molecule
Emp. Form.C24H28N8O7
Mol. Mass.540.5285
SMILESCC(C)C[C@H](NC(=O)CNC(=O)c1cnc2c(nc(N)[nH]c2=O)n1)C(=O)N[C@@H](Cc1ccc(O)cc1)C(O)=O