Reaction Details
TargetRicin
LigandBDBM50424233
Substrate/Competitorn/a
Meas. Tech.ChEMBL_934991 (CHEMBL2320360)
IC50 35000±n/a nM
Citation Saito, RPruet, JMManzano, LAJasheway, KMonzingo, AFWiget, PAKamat, IAnslyn, EVRobertus, JD Peptide-conjugated pterins as inhibitors of ricin toxin A. J Med Chem56:320-9 (2013) 
 
Ricin
Name:Ricin
Synonyms:RICI_RICCO
Type:PROTEIN
Mol. Mass.:64090.82
Organism:Ricinus communis
Description:ChEMBL_1286970
Residue:576
BDBM50424233
NameBDBM50424233
Synonyms:CHEMBL2314132
TypeSmall organic molecule
Emp. Form.C29H27N9O6
Mol. Mass.597.5814
SMILESNc1nc2nc(cnc2c(=O)[nH]1)C(=O)NCC(=O)N[C@@H](Cc1ccccc1)C(=O)N[C@@H](Cc1c[nH]c2ccccc12)C(O)=O