Reaction Details
TargetCarbonic anhydrase 2
LigandBDBM50424244
Substrate/Competitorn/a
Meas. Tech.ChEMBL_935017 (CHEMBL2320623)
Ki 349±n/a nM
Citation Balseven, HMustafaIsgör, MMert, SAlim, ZBeydemir, SOk, SKasimogullari, R Facile synthesis and characterization of novel pyrazole-sulfonamides and their inhibition effects on human carbonic anhydrase isoenzymes. Bioorg Med Chem21:21-7 (2012) 
 
Carbonic anhydrase 2
Name:Carbonic anhydrase 2
Type:Enzyme
Mol. Mass.:29250.71
Organism:Homo sapiens (Human)
Description:P00918
Residue:260
BDBM50424244
NameBDBM50424244
Synonyms:CHEMBL2314159
TypeSmall organic molecule
Emp. Form.C29H22N6O6S
Mol. Mass.582.587
SMILESNS(=O)(=O)c1ccc(NC(=O)c2nn(c(c2C(O)=O)-c2ccccc2)-c2cccc(c2)N=Nc2ccc(O)cc2)cc1