Reaction Details
TargetCarbonic anhydrase 2
LigandBDBM50424251
Substrate/Competitorn/a
Meas. Tech.ChEMBL_935017 (CHEMBL2320623)
Ki 128±n/a nM
Citation Balseven, HMustafaIsgör, MMert, SAlim, ZBeydemir, SOk, SKasimogullari, R Facile synthesis and characterization of novel pyrazole-sulfonamides and their inhibition effects on human carbonic anhydrase isoenzymes. Bioorg Med Chem21:21-7 (2012) 
 
Carbonic anhydrase 2
Name:Carbonic anhydrase 2
Type:Enzyme
Mol. Mass.:29250.71
Organism:Homo sapiens (Human)
Description:P00918
Residue:260
BDBM50424251
NameBDBM50424251
Synonyms:CHEMBL2314152
TypeSmall organic molecule
Emp. Form.C38H28N6O7S
Mol. Mass.712.73
SMILES[#7]S(=O)(=O)c1ccc(-[#7]-[#6](=O)-c2nn(c(c2-[#6](-[#8])=O)-c2ccccc2)-c2cccc(-[#7]\[#7]=[#6](\[#6](=O)-c3ccccc3)-[#6](=O)-c3ccccc3)c2)cc1