Reaction Details
TargetCarbonic anhydrase 1
LigandBDBM50424246
Substrate/Competitorn/a
Meas. Tech.ChEMBL_935018 (CHEMBL2320624)
Ki 490±n/a nM
Citation Balseven, HMustafaIsgör, MMert, SAlim, ZBeydemir, SOk, SKasimogullari, R Facile synthesis and characterization of novel pyrazole-sulfonamides and their inhibition effects on human carbonic anhydrase isoenzymes. Bioorg Med Chem21:21-7 (2012) 
 
Carbonic anhydrase 1
Name:Carbonic anhydrase 1
Type:Enzyme
Mol. Mass.:28873.37
Organism:Homo sapiens (Human)
Description:P00915
Residue:261
BDBM50424246
NameBDBM50424246
Synonyms:CHEMBL2314157
TypeSmall organic molecule
Emp. Form.C30H28N6O8S
Mol. Mass.632.644
SMILESCOC(=O)C(=NNc1cccc(c1)-n1nc(C(=O)Nc2ccc(cc2)S(N)(=O)=O)c(C(O)=O)c1-c1ccccc1)C(=O)C(C)C