Reaction Details
TargetHistamine H4 receptor
LigandBDBM50424326
Substrate/Competitorn/a
Meas. Tech.ChEMBL_935304 (CHEMBL2318421)
Ki 2930±n/a nM
Citation Gao, LJSchwed, JSWeizel, LDe Jonghe, SStark, HHerdewijn, P Synthesis and evaluation of novel ligands for the histamine H4 receptor based on a pyrrolo[2,3-d]pyrimidine scaffold. Bioorg Med Chem Lett23:132-7 (2012) 
 
Histamine H4 receptor
Name:Histamine H4 receptor
Type:G Protein-Coupled Receptor (GPCR)
Mol. Mass.:44517.02
Organism:Homo sapiens (Human)
Description:Binding assays were using CHO cells stably expressing hH4R receptors.
Residue:390
BDBM50424326
NameBDBM50424326
Synonyms:CHEMBL2314759
TypeSmall organic molecule
Emp. Form.C18H21FN6
Mol. Mass.340.3979
SMILESCN1CCCN(CC1)c1nc(N)nc2[nH]c(cc12)-c1ccc(F)cc1