Reaction Details
TargetHistamine H4 receptor
LigandBDBM50424341
Substrate/Competitorn/a
Meas. Tech.ChEMBL_935304 (CHEMBL2318421)
Ki 2670±n/a nM
Citation Gao, LJSchwed, JSWeizel, LDe Jonghe, SStark, HHerdewijn, P Synthesis and evaluation of novel ligands for the histamine H4 receptor based on a pyrrolo[2,3-d]pyrimidine scaffold. Bioorg Med Chem Lett23:132-7 (2012) 
 
Histamine H4 receptor
Name:Histamine H4 receptor
Type:G Protein-Coupled Receptor (GPCR)
Mol. Mass.:44517.02
Organism:Homo sapiens (Human)
Description:Binding assays were using CHO cells stably expressing hH4R receptors.
Residue:390
BDBM50424341
NameBDBM50424341
Synonyms:CHEMBL2314771
TypeSmall organic molecule
Emp. Form.C11H16N6
Mol. Mass.232.2849
SMILESCc1cc2c(nc(N)nc2[nH]1)N1CCNCC1