Reaction Details
TargetCannabinoid receptor 1
LigandBDBM50424466
Substrate/Competitorn/a
Meas. Tech.ChEMBL_937027 (CHEMBL2317166)
EC50 79±n/a nM
Citation Plowright, ATNilsson, KAntonsson, MAmin, KBroddefalk, JJensen, JLehmann, AJin, SSt-Onge, STomaszewski, MJTremblay, MWalpole, CWei, ZYang, HUlander, J Discovery of agonists of cannabinoid receptor 1 with restricted central nervous system penetration aimed for treatment of gastroesophageal reflux disease. J Med Chem56:220-40 (2013) 
 
Cannabinoid receptor 1
Name:Cannabinoid receptor 1
Type:G Protein-Coupled Receptor (GPCR)
Mol. Mass.:52868.96
Organism:Homo sapiens (Human)
Description:P21554
Residue:472
BDBM50424466
NameBDBM50424466
Synonyms:CHEMBL2316403
TypeSmall organic molecule
Emp. Form.C21H20N4O2
Mol. Mass.360.4091
SMILESO=C(NCC1CCC1)c1ncccc1NC(=O)c1ccnc2ccccc12