Reaction Details
TargetCannabinoid receptor 2
LigandBDBM50424463
Substrate/Competitorn/a
Meas. Tech.ChEMBL_937024 (CHEMBL2317163)
IC50 190±n/a nM
Citation Plowright, ATNilsson, KAntonsson, MAmin, KBroddefalk, JJensen, JLehmann, AJin, SSt-Onge, STomaszewski, MJTremblay, MWalpole, CWei, ZYang, HUlander, J Discovery of agonists of cannabinoid receptor 1 with restricted central nervous system penetration aimed for treatment of gastroesophageal reflux disease. J Med Chem56:220-40 (2013) 
 
Cannabinoid receptor 2
Name:Cannabinoid receptor 2
Type:G Protein-Coupled Receptor (GPCR)
Mol. Mass.:39690.94
Organism:Homo sapiens (Human)
Description:P34972
Residue:360
BDBM50424463
NameBDBM50424463
Synonyms:CHEMBL2316407
TypeSmall organic molecule
Emp. Form.C25H28N4O2
Mol. Mass.416.5154
SMILESCN(C)Cc1ccc(C(=O)Nc2cccnc2C(=O)NCC2CCC2)c2ccccc12