Reaction Details
TargetCannabinoid receptor 1
LigandBDBM50424474
Substrate/Competitorn/a
Meas. Tech.ChEMBL_937025 (CHEMBL2317164)
IC50 49±n/a nM
Citation Plowright, ATNilsson, KAntonsson, MAmin, KBroddefalk, JJensen, JLehmann, AJin, SSt-Onge, STomaszewski, MJTremblay, MWalpole, CWei, ZYang, HUlander, J Discovery of agonists of cannabinoid receptor 1 with restricted central nervous system penetration aimed for treatment of gastroesophageal reflux disease. J Med Chem56:220-40 (2013) 
 
Cannabinoid receptor 1
Name:Cannabinoid receptor 1
Type:G Protein-Coupled Receptor (GPCR)
Mol. Mass.:52868.96
Organism:Homo sapiens (Human)
Description:P21554
Residue:472
BDBM50424474
NameBDBM50424474
Synonyms:CHEMBL2316383
TypeSmall organic molecule
Emp. Form.C25H27N3O4S
Mol. Mass.465.565
SMILESCS(=O)Cc1ccc(C(=O)Nc2cccnc2C(=O)NCC2CCOCC2)c2ccccc12