Reaction Details
TargetPotassium voltage-gated channel subfamily H member 2
LigandBDBM50424473
Substrate/Competitorn/a
Meas. Tech.ChEMBL_936798 (CHEMBL2320190)
IC50 17000±n/a nM
Citation Plowright, ATNilsson, KAntonsson, MAmin, KBroddefalk, JJensen, JLehmann, AJin, SSt-Onge, STomaszewski, MJTremblay, MWalpole, CWei, ZYang, HUlander, J Discovery of agonists of cannabinoid receptor 1 with restricted central nervous system penetration aimed for treatment of gastroesophageal reflux disease. J Med Chem56:220-40 (2013) 
 
Potassium voltage-gated channel subfamily H member 2
Name:Potassium voltage-gated channel subfamily H member 2
Type:Multi-pass membrane protein
Mol. Mass.:126672.65
Organism:Homo sapiens (Human)
Description:Q12809
Residue:1159
BDBM50424473
NameBDBM50424473
Synonyms:CHEMBL2316385
TypeSmall organic molecule
Emp. Form.C23H24N4O3S
Mol. Mass.436.527
SMILESCS(=O)Cc1ccc(C(=O)Nc2nccnc2C(=O)NCC2CCC2)c2ccccc12