Reaction Details
TargetCytochrome P450 2C9
LigandBDBM50424472
Substrate/Competitorn/a
Meas. Tech.ChEMBL_936803 (CHEMBL2320437)
IC50 6700±n/a nM
Citation Plowright, ATNilsson, KAntonsson, MAmin, KBroddefalk, JJensen, JLehmann, AJin, SSt-Onge, STomaszewski, MJTremblay, MWalpole, CWei, ZYang, HUlander, J Discovery of agonists of cannabinoid receptor 1 with restricted central nervous system penetration aimed for treatment of gastroesophageal reflux disease. J Med Chem56:220-40 (2013) 
 
Cytochrome P450 2C9
Name:Cytochrome P450 2C9
Type:Enzyme
Mol. Mass.:55636.33
Organism:Homo sapiens (Human)
Description:P11712
Residue:490
BDBM50424472
NameBDBM50424472
Synonyms:CHEMBL2316386
TypeSmall organic molecule
Emp. Form.C28H33N3O6S
Mol. Mass.539.643
SMILESCS(=O)Cc1ccc(C(=O)Nc2ccc(OCCOCCO)nc2C(=O)NCC2CCC2)c2ccccc12